{"text_format":"1","workbook":"xlsx","n_sheets":12,"sheets":["Product registration form","Prices and logistic data","Shelflabel and till text","Bottle deposit","Tax - Import only","Unpacking data","Display","Set of goods","Additional GTINS","Sub-components","Measurements","Lists"],"not_rendered":{"charts":0,"images":4,"macros":1,"external_links":1,"defined_names":35,"comments":10,"pivot_tables":0},"unopened":[],"bounds":{"document_bytes":16777216,"sheet_cells":100000,"rows_first":2000,"rows_last":500,"rows_between":2000,"halvings":0,"cell_chars":16384,"cell_head_chars":4096},"cells_cut":0,"cells_raw":0,"read":"whole","date_system":"1900"}

{"sheet":"Product registration form","index":0,"n_rows":200,"n_cols":99,"rows_kept":200,"cut":false,"hidden":false,"merged":[[1,95,1,98],[1,0,1,94],[2,0,2,9],[2,68,2,78],[2,10,2,12],[2,16,2,28],[2,29,2,43],[2,44,2,46],[2,55,2,67],[2,87,2,93]]}
[null,null,null,null,null,"To be filled by vendor",null,null,null,"To be filled by buying dep.",null,null,null,null,null,null,"To be filled by Master Data."]
[]
["General                                   General                                   General",null,null,null,null,null,null,null,null,null,"ISFP Relevant",null,null,null,null,null,"Description, GTIN & PLU                                        Description, GTIN & PLU                                        Description, GTIN & PLU",null,null,null,null,null,null,null,null,null,null,null,null,"Unit of Measure                                    Unit of Measure                                    Unit of Measure                                     Unit of Measure                                    Unit of Measure                                    Unit of Measure",null,null,null,null,null,null,null,null,null,null,null,null,null,null,"Unit of Measure                                   ",null,null,null,null,null,null,"Additional Unit of Measure",null,null,null,"Basic data                                                            Basic data                                                            Basic data",null,null,null,null,null,null,null,null,null,null,null,null,"Attributes                                                  Attributes                                                  Attributes",null,null,null,null,null,null,null,null,null,null,null," Attributes",null,null,null,null,null,null,"POS DATA                                        POS DATA                                         POS DATA",null,null,null,null,null,null,null,"Step"]
["Article Type","Merch. Cat.","Artl. Category","Purch. Org.","Copy\nArticle number","Vendor\nnumber","Sales Org","Base unit of measure","Additional vendor no","Alternative unit of measure","Catch Weight","Traceability Class","Weight band","Product Cost Group","Prod. Cost Qty","Sales unit per BA","Vendor's\nname","English Description\n(MAX 40 characters)","Characters","Danish Description\n(MAX 40 characters)","Characters","GTIN\nEA (Max 13 digits)","GTIN CARTON\n(CA)","Order unit/GTIN","Internal\nOrder unit/GTIN","Trade Exact","Fake Mix","Internal GTIN","PLU","Gross weight/EA KG","Net weight/EA KG","Depth/EA MM","Width/EA MM","Height/EA MM","Gross weight/CA KG","Depth/CA MM","Width/CA MM","Height/CA MM","Gross weight/HY1 KG","Net weight/HY1 KG","Depth/HY1 MM","Width/HY1 MM","Height/HY1 MM","Sales Unit Per Carton","Cartons per layer","Cartons per pallet","Order unit","Master Case EA","Additional Carton Sales Unit Per Carton","Gross Weight/KG","Depth/MM","Width/MM","Height/MM","Additional Cartons Per Layer","Additional Cartons Per Pallet","Hierarchy node","Country of origin","Temperature","Tax\n(VAT)","Net content\n(Drained weight)","Content unit","Unpacking","Stacking Factor","Durability","Supplier\nDurability","Whse.\nDurability","Store\nDurability","Customer\nDurability","Brand\n(Single value)","Private label","SubBrand\n(Single value)","Style\n(Multiple value)","Variant\n(Single value)","Good Better Best\n(Single value)","CSR Brand\n(Multiple value)","Envir. Label\n(Multiple value)","Organic\n(Single value)","Health Claim\n(Multiple value)","ISFP Type\n(Single value)","Seasons/themes","Size/measurement","Colour","Generic_trading","Materials_Fabrics_Fibres","_TOBACCO_TRACEABLE","Costing Variant","Above","Customer Pick up center","Release date - not to be sold before","Sales rule","OTC Sales Rule","Voucher","Source List","Reverse VAT","Article Number","Manufacturer name","Part no.","E-com Ready date","Ecommerce variant"]
[null,null,null,null,null,null,null,null,null,null,null,null,null,null,null,null,null,null,{"$f":"IF(R5<>\"\",LEN(R5),\"\")","v":""},null,{"$f":"IF(T5<>\"\",LEN(T5),\"\")","v":""}]
[null,null,null,null,null,null,null,null,null,null,null,null,null,null,null,null,null,null,"",null,""]
[null,null,null,null,null,null,null,null,null,null,null,null,null,null,null,null,null,null,"",null,""]
[null,null,null,null,null,null,null,null,null,null,null,null,null,null,null,null,null,null,"",null,""]
{"$rows_left_out":193}
{"sheet":"Prices and logistic data","index":1,"n_rows":200,"n_cols":124,"rows_kept":200,"cut":false,"hidden":false,"merged":[[2,110,2,123],[2,99,2,109],[2,0,3,0],[2,1,3,1],[2,37,2,49],[2,80,2,98],[2,50,2,63],[2,21,2,36],[2,2,2,20],[2,64,2,79]]}
[]
[null,null,null,"To be filled by vendor",null,null,null,null,"To be filled by buying dep.",null,null,null,null,null,null,"To be filled by Master Data."]
["GTIN","Article description","Purchase data and price (per unit)                         Purchase data and price (per unit)                         Purchase data and price (per unit)",null,null,null,null,null,null,null,null,null,null,null,null,null,null,null,null,null,null,"Sales price                                        Sales price                                        Sales price      ",null,null,null,null,null,null,null,null,null,null,null,null,null,null,null,"Flow type                                                                                       Flow type                                                                                        Flow type                                                                                        Flow type                                                           ",null,null,null,null,null,null,null,null,null,null,null,null,"Bonus buy                                   Bonus buy                                   Bonus buy    ",null,null,null,null,null,null,null,null,null,null,null,null,null,"Supply source                                                            Supply source                                                           Supply source ",null,null,null,null,null,null,null,null,null,null,null,null,null,null,null,"Rule based/Layout module                                             Rule based/Layout module                                             Rule based/Layout module",null,null,null,null,null,null,null,null,null,null,null,null,null,null,null,null,null,null,"Consignment control (LEL)                        Consignment control (LEL)           ",null,null,null,null,null,null,null,null,null,null,"Order cut off                                        Order cut off                                        Order cut off                                         "]
[null,null,"Purchase group","Incoterm + place","Vendor\nArticle number","Delivery \ndays","Shipping  Instruction","Same\nfor all","Salling","føtex","føtex food","føtex home delivery","Bilka","føtex.dk/Bilka.dk","Wupti","Netto DK","Netto SE","Starbucks","Carls Jr","BR","Currency","Rec. sales \nprice","Same\nfor all","Salling","føtex","føtex.dk","føtex food","føtex \nconvenience","føtex home delivery","Bilka","Bilka.dk","Wupti","Netto DK","Netto SE","Starbucks","Carls Jr","BR","Same\nfor all","Salling","føtex","føtex food","føtex home delivery","Bilka","føtex.dk/Bilka.dk","Wupti","Netto DK","Netto SE","Starbucks","Carls Jr","BR","Salling","føtex","føtex.dk","føtex food","føtex convenience","føtex home delivery","Bilka","Bilka.dk","Wupti","Netto DK","Netto SE","Starbucks","Carls Jr","BR","Same\nfor all","Salling","føtex","føtex food","føtex convenience","føtex.dk/Bilka.dk","føtex home delivery","Wupti","Bilka","Netto DK","Netto SE","Starbucks","Carls Jr","BR","Flow Through","Cross docking","Same\nfor all","Salling","LM number Salling","føtex","LM number føtex","føtex food","LM number føtex food","føtex convenience","LM number føtex convenience","føtex home delivery","LM number føtex home delivery","Bilka","LM number Bilka","Netto DK","LM number Netto DK","Starbucks","Carls Jr","BR","LM number BR","Same\nfor all","Salling","føtex","føtex food","føtex home delivery","Bilka","Netto DK","Starbucks","Carls Jr","BR","DC","Same\nfor all","Salling","føtex","føtex food","føtex convenience","føtex.dk/Bilka.dk","føtex home delivery","Wupti","Bilka","Netto DK","Netto SE","Starbucks","Carls Jr","BR"]
[{"$f":"IF('Product registration form'!V5<>\"\",'Product registration form'!V5,\"\")","v":""},{"$f":"IF('Product registration form'!R5<>\"\",'Product registration form'!R5,\"\")","v":""}]
[{"$f":"IF('Product registration form'!V6<>\"\",'Product registration form'!V6,\"\")","v":""},{"$f":"IF('Product registration form'!R6<>\"\",'Product registration form'!R6,\"\")","v":""}]
[{"$f":"IF('Product registration form'!V7<>\"\",'Product registration form'!V7,\"\")","v":""},{"$f":"IF('Product registration form'!R7<>\"\",'Product registration form'!R7,\"\")","v":""}]
[{"$f":"IF('Product registration form'!V8<>\"\",'Product registration form'!V8,\"\")","v":""},{"$f":"IF('Product registration form'!R8<>\"\",'Product registration form'!R8,\"\")","v":""}]
{"$rows_left_out":193}
{"sheet":"Shelflabel and till text","index":2,"n_rows":200,"n_cols":21,"rows_kept":200,"cut":false,"hidden":false,"merged":[[2,1,3,1],[2,2,2,5],[2,0,3,0],[2,6,2,12],[2,13,2,18]]}
[]
[null,null,null,"To be filled by vendor",null,"To be filled by buying dep.",null,"To be filled by Master Data."]
["GTIN","Article description","Bilka/føtex/Salling        ",null,null,null,"Netto",null,null,null,null,null,null,"BR",null,null,null,null,null,"Till text"]
[null,null,"Article name (MAX 15 characters)","#","Additional text (MAX 12 characters)","#","Article name (MAX 24 characters)","#","Additional text (MAX 20 characters)","#","Price per 0,5 kg (meat only)","Highlight (MAX 24 characters)","#","Article name (MAX 24 characters)","#","Additional text (MAX 20 characters)","#","Highlight (MAX 24 characters)","#","Till text (MAX 20 characters)","#"]
[{"$f":"IF('Product registration form'!V5<>\"\",'Product registration form'!V5,\"\")","v":""},{"$f":"IF('Product registration form'!R5<>\"\",'Product registration form'!R5,\"\")","v":""},null,{"$f":"IF(C5<>\"\",LEN(C5),\"\")","v":""},null,{"$f":"IF(E5<>\"\",LEN(E5),\"\")","v":""},null,{"$f":"IF(G5<>\"\",LEN(G5),\"\")","v":""},null,{"$f":"IF(I5<>\"\",LEN(I5),\"\")","v":""},null,null,{"$f":"IF(L5<>\"\",LEN(L5),\"\")","v":""},null,{"$f":"IF(N5<>\"\",LEN(N5),\"\")","v":""},null,{"$f":"IF(P5<>\"\",LEN(P5),\"\")","v":""},null,{"$f":"IF(R5<>\"\",LEN(R5),\"\")","v":""},null,{"$f":"IF(T5<>\"\",LEN(T5),\"\")","v":""}]
[{"$f":"IF('Product registration form'!V6<>\"\",'Product registration form'!V6,\"\")","v":""},{"$f":"IF('Product registration form'!R6<>\"\",'Product registration form'!R6,\"\")","v":""},null,{"$f":"IF(C6<>\"\",LEN(C6),\"\")","v":""},null,{"$f":"IF(E6<>\"\",LEN(E6),\"\")","v":""},null,{"$f":"IF(G6<>\"\",LEN(G6),\"\")","v":""},null,{"$f":"IF(I6<>\"\",LEN(I6),\"\")","v":""},null,null,{"$f":"IF(L6<>\"\",LEN(L6),\"\")","v":""},null,{"$f":"IF(N6<>\"\",LEN(N6),\"\")","v":""},null,{"$f":"IF(P6<>\"\",LEN(P6),\"\")","v":""},null,{"$f":"IF(R6<>\"\",LEN(R6),\"\")","v":""},null,{"$f":"IF(T6<>\"\",LEN(T6),\"\")","v":""}]
[{"$f":"IF('Product registration form'!V7<>\"\",'Product registration form'!V7,\"\")","v":""},{"$f":"IF('Product registration form'!R7<>\"\",'Product registration form'!R7,\"\")","v":""},null,"",null,"",null,"",null,"",null,null,"",null,"",null,"",null,"",null,""]
[{"$f":"IF('Product registration form'!V8<>\"\",'Product registration form'!V8,\"\")","v":""},{"$f":"IF('Product registration form'!R8<>\"\",'Product registration form'!R8,\"\")","v":""},null,"",null,"",null,"",null,"",null,null,"",null,"",null,"",null,"",null,""]
{"$rows_left_out":193}
{"sheet":"Bottle deposit","index":3,"n_rows":200,"n_cols":10,"rows_kept":200,"cut":false,"hidden":false,"merged":[[2,1,3,1],[2,6,2,9],[2,0,3,0],[2,2,2,5]]}
[]
[null,null,null,"To be filled by vendor",null,"To be filled by buying dep."]
["GTIN","Article description","Deposit sales unit",null,null,null,"Deposit (Crate/Tray) order unit"]
[null,null,"DS Article No.","Deposit type","Deposit GTIN EA","Number of deposits in EA","DS Article No.","Description","Crate/Tray GTIN","Number of Crates/Trays  pr. order unit"]
[{"$f":"IF('Product registration form'!V5<>\"\",'Product registration form'!V5,\"\")","v":""},{"$f":"IF('Product registration form'!R5<>\"\",'Product registration form'!R5,\"\")","v":""}]
[{"$f":"IF('Product registration form'!V6<>\"\",'Product registration form'!V6,\"\")","v":""},{"$f":"IF('Product registration form'!R6<>\"\",'Product registration form'!R6,\"\")","v":""}]
[{"$f":"IF('Product registration form'!V7<>\"\",'Product registration form'!V7,\"\")","v":""},{"$f":"IF('Product registration form'!R7<>\"\",'Product registration form'!R7,\"\")","v":""}]
[{"$f":"IF('Product registration form'!V8<>\"\",'Product registration form'!V8,\"\")","v":""},{"$f":"IF('Product registration form'!R8<>\"\",'Product registration form'!R8,\"\")","v":""}]
{"$rows_left_out":193}
{"sheet":"Tax - Import only","index":4,"n_rows":200,"n_cols":13,"rows_kept":200,"cut":false,"hidden":false,"merged":[]}
[]
[]
[null,null,null,"To be filled by buying dep.",null,null,"To be filled by Master Data.",null,null,"To be filled by vendor",null,null,"Leave blank"]
["GTIN","Article description","Article no","WEEE","Product weight","Battery","21.1 Bottom cell\nweight i G","21.2 Acid blue\nweight in G","21.3 Nikkle cadmium\nweight in G","21.5 – Industrial\nweight in G","21.4 Other battery\nweight in G","Product weight minus battery"]
[{"$f":"IF('Product registration form'!V5<>\"\",'Product registration form'!V5,\"\")","v":""},{"$f":"IF('Product registration form'!R5<>\"\",'Product registration form'!R5,\"\")","v":""},null,null,{"$f":"IF('Product registration form'!#REF!<>\"\",'Product registration form'!#REF!,\"\")","v":{"$error":"#REF!"}},null,null,null,null,null,null,{"$f":"(E5*1000) - G5 - H5 - I5 - J5 - K5","v":{"$error":"#REF!"}}]
[{"$f":"IF('Product registration form'!V6<>\"\",'Product registration form'!V6,\"\")","v":""},{"$f":"IF('Product registration form'!R6<>\"\",'Product registration form'!R6,\"\")","v":""},null,null,{"$f":"IF('Product registration form'!#REF!<>\"\",'Product registration form'!#REF!,\"\")","v":{"$error":"#REF!"}},null,null,null,null,null,null,{"$f":"(E6*1000) - G6 - H6 - I6 - J6 - K6","v":{"$error":"#REF!"}}]
[{"$f":"IF('Product registration form'!V7<>\"\",'Product registration form'!V7,\"\")","v":""},{"$f":"IF('Product registration form'!R7<>\"\",'Product registration form'!R7,\"\")","v":""},null,null,{"$f":"IF('Product registration form'!#REF!<>\"\",'Product registration form'!#REF!,\"\")","v":{"$error":"#REF!"}},null,null,null,null,null,null,{"$error":"#REF!"}]
[{"$f":"IF('Product registration form'!V8<>\"\",'Product registration form'!V8,\"\")","v":""},{"$f":"IF('Product registration form'!R8<>\"\",'Product registration form'!R8,\"\")","v":""},null,null,{"$f":"IF('Product registration form'!#REF!<>\"\",'Product registration form'!#REF!,\"\")","v":{"$error":"#REF!"}},null,null,null,null,null,null,{"$error":"#REF!"}]
{"$rows_left_out":193}
{"sheet":"Unpacking data","index":5,"n_rows":200,"n_cols":9,"rows_kept":200,"cut":false,"hidden":false,"merged":[]}
[]
[]
[null,"To be filled by vendor",null,null,"To be filled by buying dep.",null,null,"To be filled by Master Data."]
["GTIN","Article description","Gross weight/BOX KG","Depth/BOX MM","Width/BOX MM","Height/BOX MM","CA Per Box","BOX per layer","BOX per pallet"]
[{"$f":"IF('Product registration form'!V5<>\"\",'Product registration form'!V5,\"\")","v":""},{"$f":"IF('Product registration form'!R5<>\"\",'Product registration form'!R5,\"\")","v":""}]
[{"$f":"IF('Product registration form'!V6<>\"\",'Product registration form'!V6,\"\")","v":""},{"$f":"IF('Product registration form'!R6<>\"\",'Product registration form'!R6,\"\")","v":""}]
[{"$f":"IF('Product registration form'!V7<>\"\",'Product registration form'!V7,\"\")","v":""},{"$f":"IF('Product registration form'!R7<>\"\",'Product registration form'!R7,\"\")","v":""}]
[{"$f":"IF('Product registration form'!V8<>\"\",'Product registration form'!V8,\"\")","v":""},{"$f":"IF('Product registration form'!R8<>\"\",'Product registration form'!R8,\"\")","v":""}]
{"$rows_left_out":193}
{"sheet":"Display","index":6,"n_rows":4,"n_cols":6,"rows_kept":4,"cut":false,"hidden":false,"merged":[[2,0,2,4]]}
[]
[null,"To be filled by vendor",null,null,null,"To be filled by buying dep."]
["If the display consists of new articles, a separate product registration form must be filled in for each new article. Note this in the comment field, for both the display and the new articles."]
["English Description Display","GTIN","Article GTIN","Quantity of sales units","DS article number"]

{"sheet":"Set of goods","index":7,"n_rows":5,"n_cols":9,"rows_kept":5,"cut":false,"hidden":false,"merged":[[2,0,2,4]]}
[]
[null,"To be filled by vendor",null,null,null,"To be filled by buying dep."]
["If the set of goods consists of new articles, a separate product registration form must be filled in for each new article. Note this in the comment field, for all new articles."]
["English Description Display","GTIN","Article GTIN","Quantity","DS article number"]
[null,null,null,null,null,null,null,null," "]

{"sheet":"Additional GTINS","index":8,"n_rows":4,"n_cols":2,"rows_kept":4,"cut":false,"hidden":false,"merged":[]}
[]
[null,"To be filled by vendor"]
[]
["English Description","GTIN"]

{"sheet":"Sub-components","index":9,"n_rows":4,"n_cols":9,"rows_kept":4,"cut":false,"hidden":false,"merged":[]}
[]
[]
[]
["English Description","Description","GTIN","Internal GTIN","Quantity","Length MM","Width MM","Height MM","Gross Weight KG"]

{"sheet":"Measurements","index":10,"n_rows":25,"n_cols":8,"rows_kept":25,"cut":false,"hidden":false,"merged":[[24,0,24,11]]}
[]
["Dimensions of a sales unit",null,null,null,null,null,null,"Dimensions of a distribution/inventory unit"]
[]
[]
[]
[]
[]
[]
{"$rows_left_out":18}
{"sheet":"Lists","index":11,"n_rows":244,"n_cols":66,"rows_kept":244,"cut":false,"hidden":true,"merged":[]}
["RP Type DC","RP Type Store","Article Type","Flow Type","Purchasing organization","Sales Rules","Yes/No","Afdeling","Article category","Supply Source F&G","Article category F&G","Article Hierachy F&G","StockPlanner","StorrageLocation","Assortment list type","Naming","Price Unit","BUoM","GBB","CSR Brand","Envir. Label","Health claims","Organic","ISFP Type","Purch grp","Supply source",null,"Merch cat","Pallet Type",null,"Multi buy key",null,"No repeat key",null,"Voucher",null,"Unit of measure",null,"Traceability",null,"RB LM",null,"Batteri","Tax","Source List",null,"Trade Exact","Catch Weight","Temperature","Currency","Deposit","Sales org","Content Unit","Deposit Type","Deposit Description","Shipping Instruction","Country of Origin",null,"Distribution Channel","Cross Docking","Product Cost Group","WEEE","Bettery","Order Unit","OTC Sales Rule","Costing Variant"]
["Z0: No Planning","PD: RP","ZADM - DS Administration","RA: Assortment articles","DS01","0 No Sales Rule","Yes","320","00 Single article","Direct vendor to store","Single article","R61255 APPLES","010 - Butcher","0001 - Store",1,"SIK (Safety)","EA","EA","Good","Anb. af dyrs besk (DK)","Allergy certified","D-Vitamins","Organic cotton","Production (ZPRD)","101 Petfood","1: Direct delivery",null,"10001 CHEESE","1,5/1",null,"0 Not allowed",null,"No repeat key allowed",null,"Blackhawk",null,"EA",null,"0 No",null,"RB",null,"Knapcelle (Zink/Kviksølv Oxid/ Sølv Oxid): Kode 21.1","0 No tax",9001,null,"1. No Data",null,"-18 C","DKK","A","0100-01","CL - Centiliter","A","COOP CRATE 30 PCS","V1 Dry","Afghanistan-AF",null,9001,9002,"1 (F) RUGBRØD - KOLDHÆVET PROD","(1.1) Temperature exchange equipment","YES","EA","0 No Rule","BAKERY"]
["Z1: DSTime-phased w.auto.rord.pnt","Z0: No Planning","ZCAT - DS Category Articles","SA: Articles sold in a seasonal period","NE02","1 Above 18 years","No","330","01 Generic article","DC to store","Logistical Normal display","R61256 PEARS","020 - Deli","0010 - Butcher",6,"SLA (Slagter)","KG","EA1","Better","ASC","Astma og allergi Danmark","Diabetes","Natrue","Easy handling","102 Coffee/Tea","2: Delivery via DC",null,"10002 COLD MEAT","1/1",null,"1 Optional use",null,"Repeat key must be used",null,"Goyada",null,"EA1",null,"1 Beef",null,"LM",null,"Blysyre: Kode 21.2","1 Full tax",9002,null,"2. Dummy approved","X","-17 C","EUR","B","0200-01","CM - Centimeter","B","CRATE (POSCH) 30 PCS","V2 Cold","Albania-AL",null,9002,9102,"2 (B) RUGBRØD - KOLDHÆVET PROD","(2.1) Laptops","NO","KG","1 Aciclovir"]
["Z2: DS Static w. Man Reord Pt","Z1: DSTime-phased w.auto.rord.pnt","ZCS - Commercial set","OT: One timer campaign article","NE04","2 Above 16 years",null,"370","10 Sales set",null,"Logistical Apple display","R61274 CAPSICUMS","030 - Bakery","0020 - Deli",null,"TEX (Tøj og sko)",null,"KG","Best","BCI","BDIH (DE)","Free of sugar (totally free)","Organic","Pre-packed (ZTG)","103 Groceries",null,null,"10003 DAIRIES","1/2",null,null,null,null,null,"Goyada - ny",null,"KG",null,"2 Veal",null,null,null,"Nikkel Cadmium: Kode 21.3","2 Half tax",9010,null,"3. Approved",null,"-16 C","GBP","C","0200-02","DL - Deciliter","C","CRATE 10 PCS","V3 Frozen","Algeria-DZ",null,9011,null,"3 (B) RUGBRØD - RUGBRØDSCHIPS","(2.2) Other equipment containing screens having a surface > 100 cm2",null,"CA","2 Ibuprofen"]
["Z3: DS Static w. auto Reord Pt","Z2: DS Static w. Man Reord Pt","ZDRP - Mix Display for ZFUL","MT: Multi timer campaign article","NE05","3 Above 15 years",null,"390","12 Display",null,null,"R61275 CUCUMBERS","040 - Bistro","0030 - Bakery",null,"REN (Rengøring)",null,"M",null,"Fair flowers fair plants","Biodegradeable","Fuldkornsmærket",null,"Raw material (ZRAW)","104 Confectionary",null,null,"10004 EGGS","1/4",null,null,null,null,null,"Lotto",null,"L",null,"3 Pork",null,null,null,"Andre: Kode 21.4","3 Low tax",9011,null,null,null,"-15 C","HKD",null,"0200-10","EA - Each","A-IMPORT","CRATE 12 PCS",null,"Amer.Virgin Is.-VI",null,9012,null,"4 (F) HVEDEBRØD - DIR. DEJFØRING","(3.1) Lamps",null,"1/4","3 Acetylsalicylsyre"]
["Z8: DS Manual Replenishment","Z3: DS Static w. auto Reord Pt","ZDS1 - DS Disp Art (Trading Gds)","AD: Administration articles, packing material (articles not sold)","NE07","4 Remember receipt w/clear codes",null,null,null,null,null,"R61276 EGGPLANTS/COURGETTES/PUMPKINS",null,"0040 - Bistro",null,"BAG (Bager)",null,null,null,"Fairtrade","CO2 Neutral","Gluten free",null,null,"105 Dry Food",null,null,"10005 FATS",null,null,null,null,null,null,null,null,"PCS",null,"4 Lamb",null,null,null,null,null,9012,null,null,null,"-14 C","PLN",null,"0400-01","G - Gram","B-IMPORT","CRATE 15 PCS",null,"Andorra-AD",null,9017,null,"5 (B) HVEDEBRØD - DIR. DEJFØRING","(4.1) Large equipment - white goods (container fraction)",null,"1/2","4 Paracetamol"]
["Z9: Mix Article Planning","Z8: DS Manual Replenishment","ZDS2 - DS Disp Art (Perishables)",null,"SA01","5 Above 12 years",null,null,null,null,null,"R61278 LETTUCE",null,null,null,"DEL (Deli)",null,null,null,"FSC","Cosmebio","Lactose free",null,null,"106 Frozen",null,null,"10006 FISH",null,null,null,null,null,null,null,null,null,null,"5 Poultry",null,null,null,null,null,9016,null,null,null,"-13 C","SEK",null,"0410-01","KG - KiloG","C-IMPORT","CRATE 20 PCS 50 CL",null,"Angola-AO",null,9018,null,"6 (F) HVEDEBRØD - KOLDHÆVET PROD","(4.2) Large equipment - Other large equipment  (container fraction)",null,"1/1","5 Cyclizin"]
["ZM: MRP for F&V and KRO articles","Z9: Mix Article Planning","ZDS3 - DS Disp Art (11 Dgt Trdg)",null,null,"6 Articles must be sold in parts",null,null,null,null,null,"R61279 MUSHROOMS",null,null,null,"F&G (Frugt & Grønt)",null,null,null,"Good weave","Dansk IP kvalitet (DK)","Light food",null,null,"107 Preserved/p+r Sauc",null,null,"10007 FROZEN",null,null,null,null,null,null,null,null,null,null,"6 Mutton",null,null,null,null,null,9017,null,null,null,"-12 C","USD",null,"0500-01","L - Liter","A-VIN IMPORT","CRATE 24 PCS 33 CL",null,"Anguilla-AI",null,9023,null,"7 (B) HVEDEBRØD - KOLDHÆVET PROD","(4.3) Large equipment - Other equipment with an external dimension > 50 cm.  (cafe fraction)",null,null,"6 Acetylcystein"]
{"$rows_left_out":236}